Build: #535 failed Changes by Matt Raible

Build result summary

Details

Completed
Duration
14 minutes
Labels
None
Show more

Code commits

Author Commit Message Commit date
Matt Raible Matt Raible 3586 APF-1292: Upgraded Tapestry version for archetypes.
Matt Raible Matt Raible 3585 APF-1295: Upgraded to Spring 3.1. Tapestry 5 fails because of https://issues.apache.org/jira/browse/TAP5-1788.
Matt Raible Matt Raible 3584 APF-1295: Upgraded to Spring 3.1. Tapestry 5 fails because of https://issues.apache.org/jira/browse/TAP5-1788.

Tests

New test failures 8
Status Test View job Duration
Collapse Failed UserListTest testSearch History
Default Job < 1 sec
java.lang.RuntimeException: Service id 'environment' has already been defined by org.apache.tapestry5.services.TapestryModule.buildEnvironment(PerthreadManager) (at TapestryModule.java:2562) and may not be redefined by org.apache.tapestry5.ioc.internal.util.InternalUtils$12@fbb5f5. You should rename one of the service builder methods.
	at org.apache.tapestry5.ioc.internal.RegistryImpl.<init>(RegistryImpl.java:180)
	at org.apache.tapestry5.ioc.RegistryBuilder.build(RegistryBuilder.java:177)
	at org.apache.tapestry5.internal.TapestryAppInitializer.createRegistry(TapestryAppInitializer.java:200)
	at org.apache.tapestry5.test.PageTester.<init>(PageTester.java:109)
	at org.appfuse.webapp.pages.BasePageTestCase$1.<init>(BasePageTestCase.java:58)
	at org.appfuse.webapp.pages.BasePageTestCase.onSetUp(BasePageTestCase.java:56)
	at sun.reflect.NativeMethodAccessorImpl.invoke0(Native Method)
(32 more lines...)
Collapse Failed UserListTest testListUsers History
Default Job 2 secs
java.lang.RuntimeException: Service id 'environment' has already been defined by org.apache.tapestry5.services.TapestryModule.buildEnvironment(PerthreadManager) (at TapestryModule.java:2562) and may not be redefined by org.apache.tapestry5.ioc.internal.util.InternalUtils$12@1dbac11. You should rename one of the service builder methods.
	at org.apache.tapestry5.ioc.internal.RegistryImpl.<init>(RegistryImpl.java:180)
	at org.apache.tapestry5.ioc.RegistryBuilder.build(RegistryBuilder.java:177)
	at org.apache.tapestry5.internal.TapestryAppInitializer.createRegistry(TapestryAppInitializer.java:200)
	at org.apache.tapestry5.test.PageTester.<init>(PageTester.java:109)
	at org.appfuse.webapp.pages.BasePageTestCase$1.<init>(BasePageTestCase.java:58)
	at org.appfuse.webapp.pages.BasePageTestCase.onSetUp(BasePageTestCase.java:56)
	at sun.reflect.NativeMethodAccessorImpl.invoke0(Native Method)
(32 more lines...)
Collapse Failed UserListTest testEditUser History
Default Job < 1 sec
java.lang.RuntimeException: Service id 'environment' has already been defined by org.apache.tapestry5.services.TapestryModule.buildEnvironment(PerthreadManager) (at TapestryModule.java:2562) and may not be redefined by org.apache.tapestry5.ioc.internal.util.InternalUtils$12@107f8ba. You should rename one of the service builder methods.
	at org.apache.tapestry5.ioc.internal.RegistryImpl.<init>(RegistryImpl.java:180)
	at org.apache.tapestry5.ioc.RegistryBuilder.build(RegistryBuilder.java:177)
	at org.apache.tapestry5.internal.TapestryAppInitializer.createRegistry(TapestryAppInitializer.java:200)
	at org.apache.tapestry5.test.PageTester.<init>(PageTester.java:109)
	at org.appfuse.webapp.pages.BasePageTestCase$1.<init>(BasePageTestCase.java:58)
	at org.appfuse.webapp.pages.BasePageTestCase.onSetUp(BasePageTestCase.java:56)
	at sun.reflect.NativeMethodAccessorImpl.invoke0(Native Method)
(32 more lines...)
Collapse Failed PasswordHintTest testActivate History
Default Job < 1 sec
java.lang.RuntimeException: Service id 'environment' has already been defined by org.apache.tapestry5.services.TapestryModule.buildEnvironment(PerthreadManager) (at TapestryModule.java:2562) and may not be redefined by org.apache.tapestry5.ioc.internal.util.InternalUtils$12@1b8737f. You should rename one of the service builder methods.
	at org.apache.tapestry5.ioc.internal.RegistryImpl.<init>(RegistryImpl.java:180)
	at org.apache.tapestry5.ioc.RegistryBuilder.build(RegistryBuilder.java:177)
	at org.apache.tapestry5.internal.TapestryAppInitializer.createRegistry(TapestryAppInitializer.java:200)
	at org.apache.tapestry5.test.PageTester.<init>(PageTester.java:109)
	at org.appfuse.webapp.pages.BasePageTestCase$1.<init>(BasePageTestCase.java:58)
	at org.appfuse.webapp.pages.BasePageTestCase.onSetUp(BasePageTestCase.java:56)
	at sun.reflect.NativeMethodAccessorImpl.invoke0(Native Method)
(32 more lines...)
Collapse Failed SignupTest testSignup History
Default Job < 1 sec
java.lang.RuntimeException: Service id 'environment' has already been defined by org.apache.tapestry5.services.TapestryModule.buildEnvironment(PerthreadManager) (at TapestryModule.java:2562) and may not be redefined by org.apache.tapestry5.ioc.internal.util.InternalUtils$12@c8aeb3. You should rename one of the service builder methods.
	at org.apache.tapestry5.ioc.internal.RegistryImpl.<init>(RegistryImpl.java:180)
	at org.apache.tapestry5.ioc.RegistryBuilder.build(RegistryBuilder.java:177)
	at org.apache.tapestry5.internal.TapestryAppInitializer.createRegistry(TapestryAppInitializer.java:200)
	at org.apache.tapestry5.test.PageTester.<init>(PageTester.java:109)
	at org.appfuse.webapp.pages.BasePageTestCase$1.<init>(BasePageTestCase.java:58)
	at org.appfuse.webapp.pages.BasePageTestCase.onSetUp(BasePageTestCase.java:56)
	at sun.reflect.NativeMethodAccessorImpl.invoke0(Native Method)
(32 more lines...)
Collapse Failed UserEditTest testRemove History
Default Job < 1 sec
java.lang.RuntimeException: Service id 'environment' has already been defined by org.apache.tapestry5.services.TapestryModule.buildEnvironment(PerthreadManager) (at TapestryModule.java:2562) and may not be redefined by org.apache.tapestry5.ioc.internal.util.InternalUtils$12@11ce012. You should rename one of the service builder methods.
	at org.apache.tapestry5.ioc.internal.RegistryImpl.<init>(RegistryImpl.java:180)
	at org.apache.tapestry5.ioc.RegistryBuilder.build(RegistryBuilder.java:177)
	at org.apache.tapestry5.internal.TapestryAppInitializer.createRegistry(TapestryAppInitializer.java:200)
	at org.apache.tapestry5.test.PageTester.<init>(PageTester.java:109)
	at org.appfuse.webapp.pages.BasePageTestCase$1.<init>(BasePageTestCase.java:58)
	at org.appfuse.webapp.pages.BasePageTestCase.onSetUp(BasePageTestCase.java:56)
	at sun.reflect.NativeMethodAccessorImpl.invoke0(Native Method)
(32 more lines...)
Collapse Failed UserEditTest testSave History
Default Job < 1 sec
java.lang.RuntimeException: Service id 'environment' has already been defined by org.apache.tapestry5.services.TapestryModule.buildEnvironment(PerthreadManager) (at TapestryModule.java:2562) and may not be redefined by org.apache.tapestry5.ioc.internal.util.InternalUtils$12@8353f6. You should rename one of the service builder methods.
	at org.apache.tapestry5.ioc.internal.RegistryImpl.<init>(RegistryImpl.java:180)
	at org.apache.tapestry5.ioc.RegistryBuilder.build(RegistryBuilder.java:177)
	at org.apache.tapestry5.internal.TapestryAppInitializer.createRegistry(TapestryAppInitializer.java:200)
	at org.apache.tapestry5.test.PageTester.<init>(PageTester.java:109)
	at org.appfuse.webapp.pages.BasePageTestCase$1.<init>(BasePageTestCase.java:58)
	at org.appfuse.webapp.pages.BasePageTestCase.onSetUp(BasePageTestCase.java:56)
	at sun.reflect.NativeMethodAccessorImpl.invoke0(Native Method)
(32 more lines...)
Collapse Failed UserEditTest testCancel History
Default Job 11 secs
java.lang.RuntimeException: Service id 'environment' has already been defined by org.apache.tapestry5.services.TapestryModule.buildEnvironment(PerthreadManager) (at TapestryModule.java:2562) and may not be redefined by org.apache.tapestry5.ioc.internal.util.InternalUtils$12@4703c. You should rename one of the service builder methods.
	at org.apache.tapestry5.ioc.internal.RegistryImpl.<init>(RegistryImpl.java:180)
	at org.apache.tapestry5.ioc.RegistryBuilder.build(RegistryBuilder.java:177)
	at org.apache.tapestry5.internal.TapestryAppInitializer.createRegistry(TapestryAppInitializer.java:200)
	at org.apache.tapestry5.test.PageTester.<init>(PageTester.java:109)
	at org.appfuse.webapp.pages.BasePageTestCase$1.<init>(BasePageTestCase.java:58)
	at org.appfuse.webapp.pages.BasePageTestCase.onSetUp(BasePageTestCase.java:56)
	at sun.reflect.NativeMethodAccessorImpl.invoke0(Native Method)
(32 more lines...)

JIRA issues

IssueDescriptionStatus
Unknown Issue TypeAPF-1292Could not obtain issue details from JIRA
Unknown Issue TypeAPF-1295Could not obtain issue details from JIRA
Unknown Issue TypeTAP5-1788Could not obtain issue details from JIRA